{"text_format":"1","workbook":"xlsx","n_sheets":5,"sheets":["Enter Payment Information","Change Log","NRA Withholding Calculation","Dropdown Lists","General"],"not_rendered":{"charts":0,"images":0,"macros":1,"external_links":0,"defined_names":49,"comments":1,"pivot_tables":0},"unopened":[{"sheet":"General","index":4,"reason":"part_missing"}],"bounds":{"document_bytes":16777216,"sheet_cells":100000,"rows_first":2000,"rows_last":500,"rows_between":2000,"halvings":0,"cell_chars":16384,"cell_head_chars":4096},"cells_cut":0,"cells_raw":0,"read":"whole","date_system":"1900"}

{"sheet":"Enter Payment Information","index":0,"n_rows":35,"n_cols":7,"rows_kept":35,"cut":false,"hidden":false,"merged":[[38,5,38,6],[34,2,45,4],[33,2,33,3],[35,5,36,6],[28,3,28,5],[1,1,1,3],[19,2,19,3],[30,3,30,5],[27,3,27,5],[5,2,5,5],[15,2,15,5],[3,1,3,3],[3,4,3,6],[25,1,25,6],[13,2,13,3],[9,2,9,3],[11,2,11,3],[7,2,7,3],[17,2,17,5],[21,2,21,3]]}
[]
[]
[]
[null,"Foreign Payees: Non-Resident Alien Withholding",null,null,{"$f":"\"Calculated per IRS Publication 901 (rev. \"&'NRA Withholding Calculation'!G1&\")\"","v":"Calculated per IRS Publication 901 (rev. March 2026)"}]
[]
[null,null,"A non-resident alien (NRA) is a person who is not a US resident for tax purposes. They are usually individuals traveling to the US from a foreign country, including foreign individuals coming to the US to perform services for a foreign company. The IRS requires tax withholding for some non-resident aliens."]
[]
[null,null,"What type of payment is this?"]
[]
[null,null,"What country is the payee from for tax purposes?",null,null,{"$f":"_xlfn.IFS(fldNRAPaymentNum=6,30,fldNRAPaymentNum=2,0,fldNRAPaymentNum=7,0,NOT(boolHasTIN),IF(fldNRAPaymentNum=3,14,30),1,IFERROR(VLOOKUP(fldNRACountry,TaxTreatyCountryList,_xlfn.IFS(fldNRAPaymentNum=3,3,fldNRAPaymentNum=4,4,1,2),0),IF(fldNRAPaymentNum=3,14,30)))","v":30}]
[]
[null,null,"What type of visa does the payee have?",null,null,{"$f":"OR(fldNRATaxRate=30,AND(fldNRATaxRate=14,fldNRAPaymentType=\"Scholarship\"),AND(fldNRATaxRate=0,OR(fldNRAPaymentNum={2,7})))","v":true}]
[]
[null,null,"Does the payee have a US tax identification number?"]
[]
[null,null,{"$f":"\"The withholding rate for this payment will \"&IF(boolIsMaxTaxRate,\"\",\"probably \")&\"be \"&fldNRATaxRate&\"%.\"","v":"The withholding rate for this payment will be 30%."}]
[]
[null,null,"Calculator - Amount the recipient will receive after withholding"]
[]
[null,null,"The department will pay this amount (incl withholding):",null,1428.57]
[]
[null,null,"The payee will receive this amount (after withholding):",null,{"$f":"ROUND(fldCalcByDept*(1-0.01*fldNRATaxRate),2)","v":1000}]
[]
[]
[]
[null,"Voucher/Payment Information"]
[]
[null,null,{"$f":"fldCalcByDept","v":1428.57},"Amount charged to Department (Put this on SIR as Control Total Amount and Extended Amount)",null,null,{"$f":"LEFT(D28,1)","v":"A"}]
[null,"+",{"$f":"fldAmt1-fldAmt2","v":-428.56999999999994},"Amount withheld (This will be paid to IRS)"]
[]
[null,null,{"$f":"fldCalcByRecd","v":1000},"Net Amount Paid to Recipient"]
[null,null,"SUM(C39:C40)"]
[]
[null,null,"Please include these required forms:",null,{"$f":"IF(LEN(C35)=0,\"No additional forms required if W-8BEN on file\",\"\")","v":""}]
[null,null,{"$f":"IF(LEN(F35)>0,F35,\"No additional forms required if W-8BEN already on file.\")","v":"☐  W-8BEN form (signed and completed; not required if supplier is already set up)\n☐  Passport (with clear image and text)\n☐  I-94 form\n☐  DS2019 form\n"},null,null,{"$f":"\"☐  W-8BEN form (signed and completed\"&IF(NOT(boolIsMaxTaxRate),\" with US TIN\",\"\")&\"; not required if supplier is already set up)\"&CHAR(10)&IF(AND(NOT(boolIsMaxTaxRate),fldNRAPaymentNum=1),\"☐  8233 form (signed and completed with US TIN)\"&CHAR(10),\"\")\n&IF(OR(fldNRAPaymentNum={1,3,5,6}),\"☐  Passport (with clear image and text)\"&CHAR(10)&\"☐  I-94 form\"&CHAR(10),\"\")\n&_xlfn.SINGLE(IF(OR(fldNRAPaymentNum={1,3,5,6}),_xlfn.IFS(fldNRAVisaType=\"F-1\",\"☐  I-20 form\"&CHAR(10),LEFT(fldNRAVisaType,2)=\"J-\",\"☐  DS2019 form\"&CHAR(10),fldNRAVisaType=\"P-1\",\"☐  Copy of performance itinerary which shows UW as a visit site\"&CHAR(10),fldNRAVisaType=\"O-1\",\"☐  Copy of performance itinerary which shows UW as a visit site\"&CHAR(10),1,\"\"),\"\"))","v":"☐  W-8BEN form (signed and completed; not required if supplier is already set up)\n☐  Passport (with clear image and text)\n☐  I-94 form\n☐  DS2019 form\n"}]

{"sheet":"Change Log","index":1,"n_rows":20,"n_cols":3,"rows_kept":20,"cut":false,"hidden":true,"merged":[]}
["Date","Change By","Changes"]
["2018-11-01","Matthew Donovan","Original Form release version"]
["2018-11-05","Matthew Donovan","Add/Remove funding string lines buttons added"]
["2018-12-07","Matthew Donovan","Changed default delivery language to \"Send as check/ACH (direct deposit)\", fixed form display issue for NRA work performed out of country"]
["2018-12-18","Matthew Donovan","Move Purchasing message to C161. Acct 2637 - Give Cash Management message (C161) if under $250; remove from DP list; bypass UW Student/Employee warnings. Remove default amount. Clarify Printing language (print second tab)"]
["2019-01-07","Matthew Donovan","Corrected message in L18 so that it correctly displayed \"Non-US Tax Resident\" instead of using default country (Australia) for cases where no country would have been selected -- Services outside of US and non-reportable payments."]
["2019-01-18","Matthew Donovan","Fixed name-range for fnd3Dept, fnd5Dept, and fnd6Dept. This broken link prevented the department number from carrying over to the printed form. Also fixed the Account Code linking for NRA withholding ('Printable Form'!$E$19)"]
["2019-03-21","Matthew Donovan","Added W-8BEN requirement for NRA performing services outside of the US. Added two more distribution lines for default view on EPI tab. PF Tab: Unlocked area to type names of signers; updated City/State display so comma only if both City/State entered; fixed version date to pull as the max('Change Log'!A:A)"]
["2019-05-09","Matthew Donovan","Added Honorarium (2620) to DP&PIR list of payment types to clear up confusion on the correct account code for people to use (keeping Prize/Award on 3750); also adding Sponsorship (3750) to DP list. Clarified W-9/W-8BEN language to specify signed documents. Unlocked Signature-Date fields (Printable Form)"]
["2019-06-21","Matthew Donovan","Changed the rounding of NRA payments; now ROUND() to nearest instead of ROUNDUP(). This will solve issues for Athletics, as their calculations round to nearest and have been off by $.01. Requested by James Muller."]
["2019-08-06","Matthew Donovan","Added Participant Report (3755) to DP&PIR list of payment types. Added documentation requirement for Membership Fees (3730)."]
["2019-10-07","Matthew Donovan","Updated W-9/W-8BEN/W-8BEN-E requirements -- Now W-8BEN(E) always required. W-8BEN(E) notes indicate US TIN required if noted to have US TIN."]
["2019-10-08","Matthew Donovan","Updated $5k+ note about talking with purchasing, to exclude insurances payments pre-approved by Risk Management."]
["2019-10-30","Matthew Donovan","Updated NRA withholding rate calculation so that 3750/3755 withholding is always 30% (as it does not fall under any treaties)"]
["2019-12-11","Matthew Donovan","Updated NRA withholding rate calculation so that 3750/3755 withholding is always 30% when not US resident; 0% when US resident and 3750/3755."]
["2020-01-14","Matthew Donovan","Updated notes in the NRA Withholding, Entertainer Tax sections indicating that these sections show based on response to previous questions."]
["2020-02-13","Matthew Donovan","Added warning for Revenue Account Codes (in the required documents); also changed font size for special notes in cell L1 on Printable Form."]
["2024-02-26","Matthew Donovan","Updated the NRA Withholding rate for Spain -- Royalties (was 5%, now 0%)"]
["2026-03-03","Matthew Donovan","Updated the form display for Workday. Removed Madison/Comprehensive toggle, removed Madison custom funding string. (Both work the same way; now looks like Madison's format but without the custom funding) Changed W-8BEN message. Removed ESTA and Homeland Security Stamp from requirements. Added Performance Itinerary requirement for O-1 visa. Changed Russia's treaties to 30% (US no longer has tax treaties with Russia)."]
["2026-03-03","Cora Beach","Removed Hungary and Russia from Treaty list (NRA Withholding Calculation tab). Added Chili. Updated Pakistan rates. "]

{"sheet":"NRA Withholding Calculation","index":2,"n_rows":58,"n_cols":7,"rows_kept":58,"cut":false,"hidden":true,"merged":[]}
["Country","Services","Scholarship","Royalties",null,"Form Version:","March 2026"]
["Australia",0,14,5]
["Austria",0,14,0]
["Bangladesh",0,0,10]
["Barbados",0,14,5]
["Belgium",0,14,0]
["Bulgaria",0,14,5]
["Canada",0,14,0]
["China, People's Republic of",0,0,10]
["Commonwealth of Independent States",0,0,0]
["Chile",0,14,10]
["Cyprus",0,0,0]
["Czech Republic",0,0,0]
["Denmark",0,14,0]
["Egypt",0,0,15]
["Estonia",0,0,10]
["Finland",0,14,0]
["France",0,0,0]
["Germany",0,0,0]
["Greece",0,14,0]
["Iceland",0,0,0]
["India",0,14,15]
["Indonesia",0,0,10]
["Ireland",0,14,0]
["Israel",0,0,10]
["Italy",0,14,0]
["Jamaica",0,14,10]
["Japan",0,14,0]
["Kazakhstan",0,0,10]
["Korea, South (Rep. of)",0,0,10]
["Latvia",0,0,10]
["Lithuania",0,0,10]
["Luxembourg",0,14,0]
["Malta",0,14,10]
["Mexico",0,14,10]
["Morocco",0,0,10]
["Netherlands",0,0,0]
["New Zealand",0,14,5]
["Norway",0,0,0]
["Pakistan",0,0,0]
["Philippines",0,0,15]
["Poland",0,0,10]
["Portugal",0,0,10]
["Romania",0,0,10]
["Slovak Republic",0,0,0]
["Slovenia",0,0,5]
["South Africa",0,14,0]
["Spain",0,0,0]
["Sri Lanka",0,14,10]
["Sweden",0,14,0]
["Switzerland",0,14,0]
["Thailand",0,0,5]
["Trinidad and Tobago",0,0,0]
["Tunisia",0,0,15]
["Turkey",0,14,10]
["Ukraine",0,0,10]
["United Kingdom",0,14,0]
["Venezuela",0,0,10]

{"sheet":"Dropdown Lists","index":3,"n_rows":264,"n_cols":19,"rows_kept":264,"cut":false,"hidden":true,"merged":[]}
["IndividualCompanyList",0,null,"DeliveryOptionsList",1,null,"Individual",8,0,0,"Company",42,0,0,null,"CountryList",48,"VisaList",7]
["Company",{"$f":"IF(radPayeeType=1,\"DP\",\"PIR\")","v":"PIR"},null,"Send as check/ACH (direct deposit)",null,null,"Entertainer - Total Payment less than $7,000 (2620)",2620,1,41,"Advertising & Notices (3740)",3740,7,0,null,"Afghanistan",{"$f":"INDEX(CountryList,Q1)","v":"Chile"},"B-1",{"$f":"INDEX(VisaList,S1)","v":"J-2"}]
["Individual",{"$f":"IF(radPayeeType=1,\"Vendor\",\"Payee\")","v":"Payee"},null,{"$f":"\"Call \"&fldPayeeLower&\" for check pickup\"","v":{"$error":"#NAME?"}},null,null,"Entertainer - Total Payment $7,000 or more (2620)",2620,1,41,"Collection Agency Fees (2622)",2622,1,7,null,"Akrotiri",null,"B-2"]
[null,{"$f":"IF(radPayeeType=1,\"vendor\",\"payee\")","v":"payee"},null,"Call department for check pickup",null,null,"Honorarium (2620)",2620,1,11,"Computers & Related Peripherals Not Capitalized (3194)",3194,7,0,null,"Albania",null,"F-1"]
["YesNoList",null,null,null,null,null,"Participant Support Allowance - RSP 133/144 Fund Only (3755)",3755,6,32,"Electricity - Central (2500)",2500,7,0,null,"Algeria",null,"H-1B"]
["Yes",null,null,"WireDraftList",1,null,"Prize/Award (3750)",3750,6,34,"Equip & Furniture not Capitalized (3195)",3195,7,0,null,"American Samoa",null,"H-4"]
["No",null,null,"No",{"$f":"LEFT(INDEX(WireDraftList,E6),3)=\"Yes\"","v":false},null,"Research Subject (2637)",2637,5,0,"Event - Audio/Visual Equipment (2894)",2894,7,0,null,"Andorra",null,"J-1"]
[null,null,null,"Yes - Wire Transfer ($35 service fee)",null,null,"Royalties (3860)",3860,4,40,"Event - Catering (2893)",2893,7,0,null,"Angola",null,"J-2"]
["boolHasInvoice",0,null,"Yes - Draft Check ($5 service fee)",null,null,"Services - Performed by a US Resident (2620)",2620,1,42,"Event - Meeting Space (2895)",2895,7,0,null,"Anguilla",null,"O-1"]
[{"$f":"B9=1","v":false},null,null,null,null,null,"Services - Performed by a Non-Resident Alien within the US (2620)",2620,1,42,"Freight (3710)",3710,7,0,null,"Antarctica",null,"P-1"]
["boolIsStudent",1,null,"NRAPaymentList",1,null,"Services - Performed by a Non-Resident Alien outside of the US (2623)",2623,2,31,"Gas - Central (2510)",2510,7,0,null,"Antigua and Barbuda",null,"TN"]
[{"$f":"B11=1","v":true},null,null,"Service (performed within US)",{"$f":"INDEX(NRAPaymentList,E11)","v":"Service (performed within US)"},null,"Student Aid/Scholarship (5711)",5711,3,0,"Honorarium (2620)",2620,1,3,null,"Argentina",null,"WB"]
["boolIsEmployee",1,null,"Service (performed outside US)",null,null,"Support - Not UW Employee and not UW student (5710)",5710,3,0,"Hospital Patient Cost (2635)",2635,1,0,null,"Armenia",null,"WT"]
[{"$f":"B13=1","v":true},null,null,"Scholarship",null,null,"Support - UW Students, Fellows, Scholars, and Trainees (5709)",5709,3,0,"Incidentals - In State (2870)",2870,7,0,null,"Aruba"]
["boolIsEntertainer",1,null,"Royalties",null,null,"Tuition & Fees - For UW Students at Other Schools (5713)",5713,3,0,"Incidentals - Out of State (2871)",2871,7,0,null,"Ashmore and Cartier Islands"]
[{"$f":"B15=1","v":true},null,null,"Research Subject",null,null,"*** I want to enter a different account code ***",null,1,60,"Incidentals - Foreign (2872)",2872,7,0,null,"Australia"]
["boolIsUSResident",1,null,"Prize/Award/Participant Support (RSP)",null,null,"*** I want to enter more than one funding string ***","Multi",1,61,"Insurance - Other (3440)",3440,7,0,null,"Austria"]
[{"$f":"B17=1","v":true},null,null,"Not Service/Scholarship/Royalty/Award",null,null,null,null,null,null,"Lodging - In State (2850)",2850,7,0,null,"Azerbaijan"]
["boolHasDORLetter",1,null,null,null,null,null,null,null,null,"Lodging - Out of State (2851)",2851,7,0,null,"Bahamas, The"]
[{"$f":"B19=1","v":true},null,null,null,null,null,null,null,null,null,"Lodging - Foreign (2852)",2852,7,0,null,"Bahrain"]
["boolHasTIN",2,null,"MealOrReceptionList (used for bool)",null,null,null,null,null,null,"Maintenance & Repair - Data Processing Equipment (2460)",2460,1,0,null,"Bangladesh"]
[{"$f":"B21=1","v":false},null,null,2860,null,null,null,null,null,null,"Maintenance & Repair - Grounds (2400)",2400,1,0,null,"Barbados"]
["boolNRAServicesInUS",0,null,2861,null,null,null,null,null,null,"Maintenance & Repair - Structure (2420)",2420,1,0,null,"Bassas da India"]
[{"$f":"B23<>2","v":true},null,null,2862,null,null,null,null,null,null,"Maintenance & Repair - Vehicles (2470)",2470,1,0,null,"Belarus"]
["boolIsMealOrReception",null,null,2893,null,null,null,null,null,null,"Maintenance & Repair - Other Equipment (2480)",2480,1,0,null,"Belgium"]
[{"$f":"COUNTIF('Enter Payment Information'!$D$28:$D$28,$D$22)+COUNTIF('Enter Payment Information'!$D$28:$D$28,$D$23)+COUNTIF('Enter Payment Information'!$D$28:$D$28,$D$24)+COUNTIF('Enter Payment Information'!$D$28:$D$28,$D$25)>0","v":false},null,null,null,null,null,null,null,null,null,"Material for Resale (3790)",3790,7,0,null,"Belize"]
["numFundingLines",3,null,null,null,null,null,null,null,null,"Meals - In State (2860)",2860,7,0,null,"Benin"]
["(range = 1-15)",null,null,4,null,null,null,null,null,null,"Meals - Out of State (2861)",2861,7,0,null,"Bermuda"]
["boolIsMembershipFee",null,null,null,null,null,null,null,null,null,"Meals - Foreign (2862)",2862,7,0,null,"Bhutan"]
[{"$f":"COUNTIF('Enter Payment Information'!$D$28:$D$28,\"3730\")+COUNTIF('Enter Payment Information'!$D$28:$D$28,3730)>0","v":false},null,null,null,null,null,null,null,null,null,"Medical Services (2630)",2630,1,0,null,"Bolivia"]
["boolHasRevenueAccount",null,null,null,null,null,null,null,null,null,"Memberships (3730)",3730,7,0,null,"Bosnia and Herzegovina"]
[{"$f":"COUNTIF('Enter Payment Information'!$G$28:$G$28,9)>0","v":false},null,null,null,null,null,null,null,null,null,"Non-Tax Reportable Services and Expenditures (2623)",2623,2,10,null,"Botswana"]
["Toggle - numCampusStyle",null,null,null,null,null,null,null,null,null,"Participant Support Allowance - RSP 133/144 Fund Only (3755)",3755,6,4,null,"Bouvet Island"]
["UWMSN=1, SHARE=2",1,null,null,null,null,null,null,null,null,"Postage (3700)",3700,7,0,null,"Brazil"]
["Toggle - numInputStyle",null,null,null,null,null,null,null,null,null,"Prizes/Award (3750)",3750,6,5,null,"British Indian Ocean Territory"]
["Dept=1, Recd=2",1,null,null,null,null,null,null,null,null,"Registration Fees - In State (2840)",2840,7,0,null,"British Virgin Islands"]
[null,null,null,null,null,null,null,null,null,null,"Registration Fees - Out of State (2841)",2841,7,0,null,"Brunei"]
[null,null,null,null,null,null,null,null,null,null,"Registration Fees - Foreign (2842)",2842,7,0,null,"Bulgaria"]
[null,null,null,null,null,null,null,null,null,null,"Rental of Other Equipment (2360)",2360,7,0,null,"Burkina Faso"]
[null,null,null,null,null,null,null,null,null,null,"Rental of Space (2320)",2320,7,0,null,"Burma"]
[null,null,null,null,null,null,null,null,null,null,"Royalties (3860)",3860,4,7,null,"Burundi"]
[null,null,null,null,null,null,null,null,null,null,"Services - Internal (UW or State) (2650)",2650,7,8,null,"Cambodia"]
[null,null,null,null,null,null,null,null,null,null,"Services - Professional (2620)",2620,1,8,null,"Cameroon"]
[null,null,null,null,null,null,null,null,null,null,"Software - Maintenance Payments (3151)",3151,7,0,null,"Canada"]
[null,null,null,null,null,null,null,null,null,null,"Software - Purchases (3150)",3150,7,0,null,"Cape Verde"]
[null,null,null,null,null,null,null,null,null,null,"Sponsorship (3750)",3750,7,0,null,"Cayman Islands"]
[null,null,null,null,null,null,null,null,null,null,"Study Abroad (2638)",2638,7,0,null,"Central African Republic"]
[null,null,null,null,null,null,null,null,null,null,"Subscriptions (3720)",3720,7,0,null,"Chad"]
[null,null,null,null,null,null,null,null,null,null,"Supplies - Classroom, Med, Rec (3104)",3104,7,0,null,"Chile"]
[null,null,null,null,null,null,null,null,null,null,"Supplies - Drafting & Photograph (3102)",3102,7,0,null,"China, People's Republic of"]
[null,null,null,null,null,null,null,null,null,null,"Supplies - Drugs & Medical (3110)",3110,7,0,null,"Christmas Island"]
[null,null,null,null,null,null,null,null,null,null,"Supplies - Experimental Animals (3103)",3103,7,0,null,"Clipperton Island"]
[null,null,null,null,null,null,null,null,null,null,"Supplies - Ground, Agric, Animal (3106)",3106,7,0,null,"Cocos (Keeling) Islands"]
[null,null,null,null,null,null,null,null,null,null,"Supplies - Laboratory (3105)",3105,7,0,null,"Colombia"]
[null,null,null,null,null,null,null,null,null,null,"Supplies - Maint/Operational (3120)",3120,7,0,null,"Commonwealth of Independent States"]
[null,null,null,null,null,null,null,null,null,null,"Supplies - Office (3101)",3101,7,0,null,"Comoros"]
[null,null,null,null,null,null,null,null,null,null,"Supplies - Vehicles (3130)",3130,7,0,null,"Congo, Democratic Republic of the"]
[null,null,null,null,null,null,null,null,null,null,"Supplies (3100)",3100,7,0,null,"Congo, Republic of the"]
[null,null,null,null,null,null,null,null,null,null,"Transfer Out - DOA Bldg Trust Fund (5805)",5805,7,0,null,"Cook Islands"]
[null,null,null,null,null,null,null,null,null,null,"Water & Sewage Service (2540)",2540,7,0,null,"Coral Sea Islands"]
[null,null,null,null,null,null,null,null,null,null,"*** I want to enter a different account code ***",null,1,15,null,"Costa Rica"]
[null,null,null,null,null,null,null,null,null,null,"*** I want to enter more than one funding string ***","Multi",1,16,null,"Cote d'Ivoire"]
[null,null,null,null,null,null,null,null,null,null,null,null,null,null,null,"Croatia"]
[null,null,null,null,null,null,null,null,null,null,null,null,null,null,null,"Cuba"]
[null,null,null,null,null,null,null,null,null,null,null,null,null,null,null,"Curacao"]
[null,null,null,null,null,null,null,null,null,null,null,null,null,null,null,"Cyprus"]
[null,null,null,null,null,null,null,null,null,null,null,null,null,null,null,"Czech Republic"]
[null,null,null,null,null,null,null,null,null,null,null,null,null,null,null,"Denmark"]
[null,null,null,null,null,null,null,null,null,null,null,null,null,null,null,"Dhekelia"]
[null,null,null,null,null,null,null,null,null,null,null,null,null,null,null,"Djibouti"]
[null,null,null,null,null,null,null,null,null,null,null,null,null,null,null,"Dominica"]
[null,null,null,null,null,null,null,null,null,null,null,null,null,null,null,"Dominican Republic"]
[null,null,null,null,null,null,null,null,null,null,null,null,null,null,null,"Ecuador"]
[null,null,null,null,null,null,null,null,null,null,null,null,null,null,null,"Egypt"]
[null,null,null,null,null,null,null,null,null,null,null,null,null,null,null,"El Salvador"]
[null,null,null,null,null,null,null,null,null,null,null,null,null,null,null,"Equatorial Guinea"]
[null,null,null,null,null,null,null,null,null,null,null,null,null,null,null,"Eritrea"]
[null,null,null,null,null,null,null,null,null,null,null,null,null,null,null,"Estonia"]
[null,null,null,null,null,null,null,null,null,null,null,null,null,null,null,"Ethiopia"]
[null,null,null,null,null,null,null,null,null,null,null,null,null,null,null,"Europa Island"]
[null,null,null,null,null,null,null,null,null,null,null,null,null,null,null,"Falkland Islands (Islas Malvinas)"]
[null,null,null,null,null,null,null,null,null,null,null,null,null,null,null,"Faroe Islands"]
[null,null,null,null,null,null,null,null,null,null,null,null,null,null,null,"Fiji"]
[null,null,null,null,null,null,null,null,null,null,null,null,null,null,null,"Finland"]
[null,null,null,null,null,null,null,null,null,null,null,null,null,null,null,"France"]
[null,null,null,null,null,null,null,null,null,null,null,null,null,null,null,"French Guiana"]
[null,null,null,null,null,null,null,null,null,null,null,null,null,null,null,"French Polynesia"]
[null,null,null,null,null,null,null,null,null,null,null,null,null,null,null,"French Southern and Antarctic Lands"]
[null,null,null,null,null,null,null,null,null,null,null,null,null,null,null,"Gabon"]
[null,null,null,null,null,null,null,null,null,null,null,null,null,null,null,"Gambia, The"]
[null,null,null,null,null,null,null,null,null,null,null,null,null,null,null,"Gaza Strip"]
[null,null,null,null,null,null,null,null,null,null,null,null,null,null,null,"Georgia"]
[null,null,null,null,null,null,null,null,null,null,null,null,null,null,null,"Germany"]
[null,null,null,null,null,null,null,null,null,null,null,null,null,null,null,"Ghana"]
[null,null,null,null,null,null,null,null,null,null,null,null,null,null,null,"Gibraltar"]
[null,null,null,null,null,null,null,null,null,null,null,null,null,null,null,"Glorioso Islands"]
[null,null,null,null,null,null,null,null,null,null,null,null,null,null,null,"Greece"]
[null,null,null,null,null,null,null,null,null,null,null,null,null,null,null,"Greenland"]
[null,null,null,null,null,null,null,null,null,null,null,null,null,null,null,"Grenada"]
[null,null,null,null,null,null,null,null,null,null,null,null,null,null,null,"Guadeloupe"]
[null,null,null,null,null,null,null,null,null,null,null,null,null,null,null,"Guam"]
[null,null,null,null,null,null,null,null,null,null,null,null,null,null,null,"Guatemala"]
[null,null,null,null,null,null,null,null,null,null,null,null,null,null,null,"Guernsey"]
[null,null,null,null,null,null,null,null,null,null,null,null,null,null,null,"Guinea"]
[null,null,null,null,null,null,null,null,null,null,null,null,null,null,null,"Guinea-Bissau"]
[null,null,null,null,null,null,null,null,null,null,null,null,null,null,null,"Guyana"]
[null,null,null,null,null,null,null,null,null,null,null,null,null,null,null,"Haiti"]
[null,null,null,null,null,null,null,null,null,null,null,null,null,null,null,"Heard Island and McDonald Islands"]
[null,null,null,null,null,null,null,null,null,null,null,null,null,null,null,"Holy See"]
[null,null,null,null,null,null,null,null,null,null,null,null,null,null,null,"Holy See (Vatican City)"]
[null,null,null,null,null,null,null,null,null,null,null,null,null,null,null,"Honduras"]
[null,null,null,null,null,null,null,null,null,null,null,null,null,null,null,"Hong Kong"]
[null,null,null,null,null,null,null,null,null,null,null,null,null,null,null,"Hungary"]
[null,null,null,null,null,null,null,null,null,null,null,null,null,null,null,"Iceland"]
[null,null,null,null,null,null,null,null,null,null,null,null,null,null,null,"India"]
[null,null,null,null,null,null,null,null,null,null,null,null,null,null,null,"Indonesia"]
[null,null,null,null,null,null,null,null,null,null,null,null,null,null,null,"Iran"]
[null,null,null,null,null,null,null,null,null,null,null,null,null,null,null,"Iraq"]
[null,null,null,null,null,null,null,null,null,null,null,null,null,null,null,"Ireland"]
[null,null,null,null,null,null,null,null,null,null,null,null,null,null,null,"Isle of Man"]
{"$rows_left_out":144}